تفاضل معکوسه
type: Concept
broader: درون‌یابی کسری
preferred label: reciprocal difference @en
scope note: یک فن درونیابی مبتنی بر خارج قسمتهای متوالی تفاضلی که با استفاده از مقادیر تابع تشکیل می شوند به طوری که بسطی به کسر مسلسل به دست آید که تابع مفروض را به وسیله تابعی گویا تقریب زند.

درون‌یابی کسری
type: Concept
narrower: تفاضل معکوسه
preferred label: rational interpolation @en