همبستگی نکول
type: Concept
broader: نکول
preferred label: default correlation @en

نکول
type: Concept
broader: نظریه ورشکستگی
narrower: همبستگی نکول
preferred label: default @en
scope note: ناکامی در پرداخت فوری سود یا اصل سرمایه در زمان معین

نظریه ورشکستگی
type: Concept
narrower: نکول
preferred label: ruin theory @en