فرایند اَدَمز-بشفرت
type: Concept
alternative label: روش آدمز-بشفرت
broader: روش چندمرحله‌ای
preferred label: Adams-Bashforth process @en
related: معادله سفت
scope note: روشی برای انتگرال‌گیری عددی که در آن از فرمول‌های درونیابی گرگوری برای بسط تابع استفاده می‌شود.

روش چندمرحله‌ای
type: Concept
narrower: فرایند اَدَمز-بشفرت
preferred label: multistep method @en

معادله سفت
type: Concept
preferred label: stiff equation @en
related: فرایند اَدَمز-بشفرت