تاریخ بیرونی ریاضی
type: Concept
broader: تاریخ ریاضیات
preferred label: exterior history of math @en
scope note: سیر ریاضیات تحت عوامل بیرونی و سایر علوم.

تاریخ ریاضیات
type: Concept
narrower: تاریخ بیرونی ریاضی
preferred label: history of mathematics @en