ریاضیات محض
type: Concept
broader: تاریخ ریاضیات
preferred label: pure mathematics @en
scope note: بررسی درونی ساختارهای ریاضی بدون توجه به کاربرد نتایج آن برای مقاصد عملی.

تاریخ ریاضیات
type: Concept
narrower: ریاضیات محض
preferred label: history of mathematics @en