اندازه داخلی منظم
type: Concept
broader: اندازه داخلی
preferred label: regular inner measure @en

اندازه داخلی
type: Concept
broader: انتگرال لبگ
narrower: اندازه داخلی منظم
preferred label: inner measure @en
scope note: اندازه ای که مقدارش روی یک مجموعه S کوچکترین کران بالای اندازه های لبگ مجموعه های بسته واقع در S است.

انتگرال لبگ
type: Concept
narrower: اندازه داخلی
preferred label: Lebesgue integral @en