چندجمله‌ای رخ
type: Concept
broader: مسئله رخ‌ها
preferred label: rook polynomial @en

مسئله رخ‌ها
type: Concept
broader: ترکیبیات شمارشی
narrower: چندجمله‌ای رخ
preferred label: rook problem @en
scope note: مساله تعیین تعداد راه هایی که تعداد مشخصی رخ را می توان در صفحه شطرنج قرار داد به طوری که هیچ رخی، رخ دیگر را تهدید نکند.

ترکیبیات شمارشی
type: Concept
narrower: مسئله رخ‌ها
preferred label: enumerative combinatorics @en