عدد زوج‌ها
type: Concept
alternative label: ترتیب زوج‌ها
broader: مسئله زوج‌ها
preferred label: menage number @en
scope note: تعداد راههایی که n زن و n شوهر می توانند دور یک میز گرد بنشینند بطوری که هیچ زنی کنار شوهرش نباشد و در عین حال، دو جنس یک در میان بنشینند.

مسئله زوج‌ها
type: Concept
narrower: عدد زوج‌ها
preferred label: menage problem @en