عدد زوج‌ها
type: Concept
broader: مسئله زوج‌ها
preferred label: menage number @en

مسئله زوج‌ها
type: Concept
alternative label: مساله ترتیب
broader: ترکیبیات شمارشی
narrower: عدد زوج‌ها
preferred label: menage problem @en
scope note: مساله نشستن تعدادی مشخص زن و شوهر به دور یک میزگرد به طوری که دوجنس به تناوب کنار هم بنشینند و هیچ زن و شوهری کنار هم نباشند.

ترکیبیات شمارشی
type: Concept
narrower: مسئله زوج‌ها
preferred label: enumerative combinatorics @en