اکتومینو
type: Concept
alternative label: هشت مربعی
broader: چندآمینو
preferred label: octomino @en
scope note: هر یک از 369 شکل مسطحی که می توان با الحاق هشت مربع با طول ضلع واحد ساخت.

چندآمینو
type: Concept
narrower: اکتومینو
preferred label: polyomino @en