هگزومینو
type: Concept
alternative label: شش مربعی
broader: چندآمینو
preferred label: hexomino @en
scope note: هر یک از 35 شکل مسطحی که می توان با الحاق شش مربع به طول ضلع واحد ساخت، بطوری که هر دو مربع مجاور در یک ضلع مشترک باشند.

چندآمینو
type: Concept
narrower: هگزومینو
preferred label: polyomino @en