الگوریتم محاسبه بلوک
type: Concept
preferred label: computing of block algorithm @en
related: نیا

نیا
type: Concept
alternative label: جد
broader: درخت ریشه‌دار
preferred label: ancestor @en
related: الگوریتم محاسبه بلوک
scope note: اگر یک راس دارای شماره سطح کوچکتری نسبت به راس دوم در درخت ریشه دار باشد، آنگاه راس اول نیای راس دوم است.

درخت ریشه‌دار
type: Concept
narrower: نیا
preferred label: rooted tree @en