ابرگراف جزئی
type: Concept
broader: ابرگراف
preferred label: partial hypergraph @en
scope note: ابرگرافی که بعضی از یالهایش حذف شده است.

ابرگراف
type: Concept
narrower: ابرگراف جزئی
preferred label: hypergraph @en