ابرگراف راس-متقارن
type: Concept
broader: ابرگراف
preferred label: vertex-symmetric hypergraph @en
scope note: ابرگرافی که همه راس هایش متقارن هستند، دو راس متقارنند اگر یک اتومورفیسم اولی را به دومی بنگارد .

ابرگراف
type: Concept
narrower: ابرگراف راس-متقارن
preferred label: hypergraph @en