خوشه
type: Concept
preferred label: clique @en
related: ترتیب حذف سادکی

ترتیب حذف سادکی
type: Concept
alternative label: ترتیب حذف کامل
broader: گراف وتری
preferred label: simplicial elimination ordering @en
related: خوشه
scope note: ترتیب روی راس های گراف بطوری که با حذف هر راس، راس بعدی در همسایگی یک خوشه قرار می گیرد.

گراف وتری
type: Concept
narrower: ترتیب حذف سادکی
preferred label: chordal graph @en