تابع سه‌سه‌ای کانتور
type: Concept
preferred label: Cantor ternary function @en
related: مجموع سه‌سه‌ای کانتور

مجموع سه‌سه‌ای کانتور
type: Concept
broader: مجموعه اندازه‌پذیر
preferred label: Cantor ternary set @en
related: تابع سه‌سه‌ای کانتور
scope note: زیر مجموعه ای کلا ناهمبند، ناشمارا و تام از اعداد حقیقی که اندازه لبگ صفر دارد. این مجموعه مرکب از همه اعداد بین 0 و 1 با نمایش های سه سه ای که شامل رقم یک نباشند.

مجموعه اندازه‌پذیر
type: Concept
narrower: مجموع سه‌سه‌ای کانتور
preferred label: measurable set @en