متمم گراف
type: Concept
alternative label: مکمل گراف
broader: دسته‌بندی ساختاری گراف‌ها
preferred label: complement of a graph @en
scope note: گرافی با همان مجموعه راس، دو راس در آن متصل اند اگر وفقط اگر در گراف اولیه متصل نباشند.

دسته‌بندی ساختاری گراف‌ها
type: Concept
narrower: متمم گراف
preferred label: structural characterization of graphs @en