رنگ‌آمیزی لیستی
type: Concept
broader: رنگ‌آمیزی گراف
preferred label: list coloring @en
scope note: در رنگ آمیزی لیستی راس ها، برای هر راس یک لیست انتخابی از رنگ ها وجود دارد.

رنگ‌آمیزی گراف
type: Concept
narrower: رنگ‌آمیزی لیستی
preferred label: graph coloring @en