قضیه ویزینگ
type: Concept
broader: رنگ‌آمیزی یالی
preferred label: Vizing theorem @en
scope note: در هر گراف ساده، عدد رنگی یالی حداکثر یکی بیشتر از عدد خوشه گراف است.

رنگ‌آمیزی یالی
type: Concept
narrower: قضیه ویزینگ
preferred label: edge coloring @en