حدس بوچت
type: Concept
broader: شبکه جریان
preferred label: Bouchet conjecture @en
scope note: هرگراف دوجهتی که یک جریان هیچ‌جا صفر بپذیرد،یک 6-جریان دوجهتی هیچ‌جا صفر میپذیرد.

شبکه جریان
type: Concept
narrower: حدس بوچت
preferred label: flow network @en