قضیه گراف تام
type: Concept
broader: گراف تام
preferred label: perfect graph theorem @en
scope note: یک گراف تام است اگر و تنها اگر مولفه هایش تام باشند.

گراف تام
type: Concept
narrower: قضیه گراف تام
preferred label: perfect graph @en