گراف کلبش
type: Concept
broader: گراف قوی‌منتظم
preferred label: Clebsch graph @en
scope note: مجموعه همه زیرمجموعه های تعداد زوج یک مجموعه 5 عضوی. 16راس دارد.

گراف قوی‌منتظم
type: Concept
narrower: گراف کلبش
preferred label: strongly regular graph @en