دوگان ضعیف
type: Concept
broader: گراف مسطح
preferred label: weak dual @en
related: گراف دوگان
scope note: گراف دوگان یک گراف مسطح، با حذف راس های متناظر با وجه های بیکران.

گراف دوگان
type: Concept
preferred label: dual graph @en
related: دوگان ضعیف

گراف مسطح
type: Concept
narrower: دوگان ضعیف
preferred label: planar graph @en