کلاس موروثی
type: Concept
broader: گراف‌های یک‌ریخت
preferred label: hereditary class @en
scope note: کلاسی از گرافها که نسبت به یکریختی و زیرگراف های تولیدشده بسته اند، کلاس موروثی گویند.

گراف‌های یک‌ریخت
type: Concept
narrower: کلاس موروثی
preferred label: isomorphic graphs @en