قضیه نگاشت ریمان
type: Concept
broader: تابع تام
preferred label: Riemann mapping theorem @en
related: نگاشت همدیس
scope note: اگر D یک دامنه همبند ساده در صفحه مختلط باشد و D تمام صفحه مختلط نباشد، آنگاه نگاشت همدیسی ازD به روی قرص واحد باز B وجود دارد.

تابع تام
type: Concept
narrower: قضیه نگاشت ریمان
preferred label: entire function @en

نگاشت همدیس
type: Concept
preferred label: conformal mapping @en
related: قضیه نگاشت ریمان