گنجایش در صفحه مختلط
type: Concept
alternative label: ظرفیت در صفحه مختلط
broader: نظریه تابع هندسی
preferred label: capacity in the complex plane @en
scope note: گنجایش تحلیلی یک زیرمجموعه فشرده از صفحه مختلط، عددی است که بزرگی تابع تحلیلی کراندار از متمم آن مجموعه در صفحه مختلط می تواند باشد را نشان می دهد.

نظریه تابع هندسی
type: Concept
narrower: گنجایش در صفحه مختلط
preferred label: geometric function theory @en