درون برد
type: Concept
broader: فضای توپولوژیک
preferred label: retract @en
scope note: اگر A زیر مجموعه ای از فضای توپولوژیک X باشد , A را یک درون بر X نامند اگر نگاشت پیوسته ای چون f از X به A وجود داشته باشد که تحدید آن به A نگاشت همانی باشد.

فضای توپولوژیک
type: Concept
narrower: درون برد
preferred label: topological space @en