فشرده‌سازی استون-چخ
type: Concept
broader: فشرده‌سازی
preferred label: Stone-Cech compactification @en
scope note: حاصل این فشرده سازی یک فضای کاملا منظم هاسدورف است که در آن فضای اولیه زیر مجموعه چگالی تشکیل می دهد به طوری که هر تایع پیوسته از فضای اولیه به فضایی فشرده توسیع پیوسته یکتایی به آن فضای هاسدورف دارد.

فشرده‌سازی
type: Concept
narrower: فشرده‌سازی استون-چخ
preferred label: compactification @en