فضای متریک‌پذیر
type: Concept
preferred label: metrizable space @en
related: قضیه اوریسون

قضیه اوریسون
type: Concept
broader: فضای منظم
preferred label: Urysohn theorem @en
related: فضای متریک‌پذیر
scope note: یک فضای منظم که توپولوژی آن پایه شمارایی دارد، متریک پذیر است.

فضای منظم
type: Concept
narrower: قضیه اوریسون
preferred label: regular space @en