مجموعه ناهمبند
type: Concept
broader: فضای توپولوژیک
preferred label: disconnected set @en
scope note: مجموعه ای که اجتماع دو مجموعه ناتهی Aو B است که هم اشتراک بستار A با B و هم اشتراک بستار B با A تهی اند.

فضای توپولوژیک
type: Concept
narrower: مجموعه ناهمبند
preferred label: topological space @en