نقطه انباشتگی
type: Concept
alternative label: نقطه حدی
broader: فضای توپولوژیک
preferred label: accumulation point @en
related: دنباله
scope note: نقطه انباشتگی یک مجموعه در یک فضای توپولوژیک نقطه ای است که همه همسایگی های آن شامل دست کم یک نقطه از مجموعه غیر از خود نقطه باشند.

فضای توپولوژیک
type: Concept
narrower: نقطه انباشتگی
preferred label: topological space @en

دنباله
type: Concept
preferred label: sequence @en
related: نقطه انباشتگی