برنامه‌ریزی محدب
type: Concept
preferred label: convex programming @en
related: ویژگی موضعا محدب

ویژگی موضعا محدب
type: Concept
broader: توپولوژی عمومی
preferred label: locally convex property @en
related: برنامه‌ریزی محدب
scope note: فضای برداری توپولوژیکی که هر همسایگی مبدا آن شامل یک همسایگی محدب است

توپولوژی عمومی
type: Concept
narrower: ویژگی موضعا محدب
preferred label: general topology @en