گره هذلولوی
type: Concept
broader: گره
preferred label: hyperbolic knot @en
scope note: گرهی است که متمم آن یک منیفلد سه‌بعدی هذلولوی است. حجم هذلولوی این گره برابر با حجم متمم آن است.

گره
type: Concept
narrower: گره هذلولوی
preferred label: knot @en