آزمون بارتلت
type: Concept
broader: آزمون ناپارامتری
preferred label: Bartlett test @en
related: واریانس
scope note: روشی برای آزمودن برابری‌های واریانس‌ها از تعدادی نمونه نرمال مستقل، از طریق آزمودن فرض است.

آزمون ناپارامتری
type: Concept
narrower: آزمون بارتلت
preferred label: non-parametric test @en

واریانس
type: Concept
preferred label: variance @en
related: آزمون بارتلت