انحراف میانگین مطلق
type: Concept
broader: انحراف متوسط
preferred label: absolute mean deviation @en
related: شیمی تجزیه
scope note: انحراف میانگین مطلق، میانگین حسابی قدر مطلق انحرافات یک متغیر از مقدار مورد انتظارش می باشد.

انحراف متوسط
type: Concept
narrower: انحراف میانگین مطلق
preferred label: average deviation @en

شیمی تجزیه
type: Concept
preferred label: analytical chemistry @en
related: انحراف میانگین مطلق