انحراف چارکی
type: Concept
broader: چارک
preferred label: quartile deviation @en
scope note: نصف اختلاف بین چارک های بالا و پایین یعنی چارک های سوم و اول.

چارک
type: Concept
narrower: انحراف چارکی
preferred label: quartile @en