فراوانی خانه‌ای
type: Concept
broader: فراوانی
preferred label: cell frequency @en
scope note: تعداد مشاهدات مربوط به قیود شرطی مشخصی روی یک یا چند متغیر است.

فراوانی
type: Concept
narrower: فراوانی خانه‌ای
preferred label: frequency @en