فراوانی رده
type: Concept
broader: فراوانی
preferred label: class frequency @en
scope note: فراوانی ای که یک متغیر تصادفی مقادیر موجود در یک بازه رده ای مفروض را با آن فراوانی اختیار می کند.

فراوانی
type: Concept
narrower: فراوانی رده
preferred label: frequency @en