تابع علامت
type: Concept
broader: تابع
preferred label: signum function @en
scope note: تابعی که همه مقادیر مثبت را به عدد یک و مقادیر منفی را به منفی یک و عدد صفر را به صفر می برد.

تابع
type: Concept
narrower: تابع علامت
preferred label: function @en