درون چرخزاد
type: Concept
broader: خم
preferred label: hypocycloid @en
scope note: خم مسطحی حاصل از حرکت نقطه ای ثابت واقع بر یک دایره در حالی که این دایره در درون دایره دیگری و مماس بر آن می غلتد.

خم
type: Concept
narrower: درون چرخزاد
preferred label: curve @en