طوق
type: Concept
alternative label: تاج دایره
broader: خم
preferred label: annulus @en
scope note: شکلی حلقه مانند که بین دو دایره هم مرکز واقع است.

خم
type: Concept
narrower: طوق
preferred label: curve @en