تحلیل بافه‌ای
type: Concept
broader: تحلیل رگرسیون
preferred label: bunch-map analysis @en
scope note: روشی نموداری در تحلیل همشار که همه زیرمجموعه های ضریبهای رگرسیونی در یک مجموعۀ کامل با نمودارهای متعارف مشخص می شوند و نمایش هر مجموعۀ ضریبهای رگرسیونی، بافه یا دسته ای از خطوط پدید می آورد.

تحلیل رگرسیون
type: Concept
narrower: تحلیل بافه‌ای
preferred label: regression analysis @en