تابع مشتق‌پذیر
type: Concept
preferred label: differentiable function @en
related: قضیه رول

قضیه رول
type: Concept
broader: مشتق
preferred label: Rolle theorem @en
related: تابع مشتق‌پذیر
scope note: اگر تابعی بر بازه بسته ای پیوسته و بر بازه باز آن مشتق پذیر باشد و مقدار تابع در نقاط ابتدا و انتهای بازه برابر باشد آنگاه نقطه ای در این بازه موجودست که مشتق تابع در این نقطه برابر صفر است .

مشتق
type: Concept
narrower: قضیه رول
preferred label: derivative @en