توزیع توان دوم خی نامرکزی
type: Concept
alternative label: توزیع مربع خی نامرکزی
broader: توزیع توان دوم خی
preferred label: non-central chi-square distribution @en
scope note: توزیع مجموع مربعات متغیرهای تصادفی نرمال مستقل که برای تعیین تابع توان آزمون خی دو به کار می رود.

توزیع توان دوم خی
type: Concept
narrower: توزیع توان دوم خی نامرکزی
preferred label: chi-squared distribution @en