تابع بحرانی
type: Concept
broader: حساب وردش
preferred label: critical function @en
related: معادله اویلر
scope note: تابعی که در معادلات اویلر در حساب وردش ها صدق می کند.

حساب وردش
type: Concept
narrower: تابع بحرانی
preferred label: calculus of variation @en

معادله اویلر
type: Concept
preferred label: Euler equation @en
related: تابع بحرانی