وردش کلی
type: Concept
alternative label: تغییر کلی
broader: وردش
preferred label: total variation @en
scope note: برای تابعی حقیقی که بر بازه ای تعریف شده ، کوچکترین کران بالایی وردش تابع نسبت به همه افرازهای ممکن آن بازه .

وردش
type: Concept
narrower: وردش کلی
preferred label: variation @en