توزیع ژیبرا
type: Concept
broader: توزیع آماری
preferred label: Gibrat distribution @en
scope note: توزیع متغیری که لگاریتم آن یک توزیع نرمال دارد.

توزیع آماری
type: Concept
narrower: توزیع ژیبرا
preferred label: statistical distribution @en