پروتکل کلید مشترک نیدهام-شرودر
type: Concept
broader: پروتکل توزیع کلید
preferred label: Needham-schroeder public key protocol @en
scope note: بر اساس الگوریتم رمز متقارن و برای استفاده در یک محیط ناامن

پروتکل توزیع کلید
type: Concept
narrower: پروتکل کلید مشترک نیدهام-شرودر
preferred label: key distribution protocol @en