حمله خارجی
type: Concept
broader: حملات رمزنگاری
preferred label: external attack @en
scope note: توسط یک کاربر غیر مجاز از محیط بیرونی آغاز می شود.

حملات رمزنگاری
type: Concept
narrower: حمله خارجی
preferred label: cryptographic attacks @en