حمله داخلی
type: Concept
broader: حملات رمزنگاری
preferred label: internal attack @en
scope note: توسط یک عامل در داخل محیط امنیتی آغاز می شود.

حملات رمزنگاری
type: Concept
narrower: حمله داخلی
preferred label: cryptographic attacks @en